Uploaded image for project: 'Percona XtraBackup'
  1. Percona XtraBackup
  2. PXB-1417

LP #1647551: Compilation failure of PXB 2.3 with -DWITH_DEBUG and -DWITH_SSL=system

    XMLWordPrintable

    Details

    • Type: Bug
    • Status: Done
    • Priority: Low
    • Resolution: Fixed
    • Affects Version/s: None
    • Fix Version/s: None
    • Component/s: None
    • Labels:

      Description

      **Reported in Launchpad by Sergei Glushchenko last update 06-12-2016 06:51:19

      17:42:05 [ 8%] Building C object regex/CMakeFiles/regex.dir/regerror.c.o
      17:42:05 /mnt/workspace/qa.pxb23.build/BUILD_TYPE/debug/label_exp/ubuntu-xenial-64bit/vio/viossl.c: In function 'ssl_do':
      17:42:05 /mnt/workspace/qa.pxb23.build/BUILD_TYPE/debug/label_exp/ubuntu-xenial-64bit/vio/viossl.c:405:5: error: ISO C90 forbids mixed declarations and code [-Werror=declaration-after-statement]
      17:42:05 int j, n = sk_SSL_COMP_num(ssl_comp_methods);
      17:42:05 ^
      17:42:05 cc1: all warnings being treated as errors
      17:42:05 vio/CMakeFiles/vio.dir/build.make:110: recipe for target 'vio/CMakeFiles/vio.dir/viossl.c.o' failed
      17:42:05 make[2]: *** [vio/CMakeFiles/vio.dir/viossl.c.o] Error 1
      17:42:05 CMakeFiles/Makefile2:2570: recipe for target 'vio/CMakeFiles/vio.dir/all' failed
      17:42:05 make[1]: *** [vio/CMakeFiles/vio.dir/all] Error 2
      17:42:05 make[1]: *** Waiting for unfinished jobs....

        Smart Checklist

          Attachments

            Activity

              People

              Assignee:
              Unassigned
              Reporter:
              lpjirasync lpjirasync (Inactive)
              Votes:
              0 Vote for this issue
              Watchers:
              1 Start watching this issue

                Dates

                Created:
                Updated:
                Resolved: