Uploaded image for project: 'Percona XtraBackup'
  1. Percona XtraBackup
  2. PXB-930

LP #1402450: xtrabackup 2.2 and 2.3 failed to compile in source tree subdirectory

    Details

    • Type: Bug
    • Status: Done
    • Priority: Low
    • Resolution: Fixed
    • Affects Version/s: None
    • Fix Version/s: None
    • Component/s: None
    • Labels:

      Description

      **Reported in Launchpad by Sergei Glushchenko last update 17-12-2014 10:27:21

      Clone bzr repo create subdirectory "obj" in it, run

      $ cd obj
      $ cmake ..
      $ make

      Make will fail with following error message:

      70%] Building CXX object storage/innobase/xtrabackup/src/CMakeFiles/xtrabackup.dir/xtrabackup.cc.o
      /Users/sergei/percona/repo/xb-bug1368846/2.2-xb-bug1368846/storage/innobase/xtrabackup/src/xtrabackup.cc:74:10: fatal error:
      'xtrabackup_version.h' file not found
      #include "xtrabackup_version.h"
      ^
      1 error generated.
      make[2]: *** [storage/innobase/xtrabackup/src/CMakeFiles/xtrabackup.dir/xtrabackup.cc.o] Error 1
      make[1]: *** [storage/innobase/xtrabackup/src/CMakeFiles/xtrabackup.dir/all] Error 2
      make: *** [all] Error 2

        Smart Checklist

          Attachments

            Activity

              People

              • Assignee:
                Unassigned
                Reporter:
                lpjirasync lpjirasync (Inactive)
              • Votes:
                0 Vote for this issue
                Watchers:
                1 Start watching this issue

                Dates

                • Created:
                  Updated:
                  Resolved: