Uploaded image for project: 'Percona Server for MySQL'
  1. Percona Server for MySQL
  2. PS-4336

PerconaFT does not build standalone or with -DBUILD_TESTING=ON

    XMLWordPrintable

    Details

    • Type: Bug
    • Status: Done
    • Priority: High
    • Resolution: Done
    • Affects Version/s: None
    • Fix Version/s: 5.6.38-83.0, 5.7.20-18
    • Component/s: TokuDB
    • Labels:
      None

      Description

      TDB-64 introduced this. This means that we can not run ctests.

       

      ../libft.so: undefined reference to `locktree_request_info_retry_cv_key'
      ../libft.so: undefined reference to `locktree_request_info_retry_mutex_key'
      ../libft.so: undefined reference to `locktree_request_info_mutex_key'
      collect2: error: ld returned 1 exit status
      make[2]: *** [ft/tests/block_allocator_test] Error 1
      make[1]: *** [ft/tests/CMakeFiles/block_allocator_test.dir/all] Error 2
      make[1]: *** Waiting for unfinished jobs....
      ../libft.so: undefined reference to `locktree_request_info_retry_cv_key'
      ../libft.so: undefined reference to `locktree_request_info_retry_mutex_key'
      ../libft.so: undefined reference to `locktree_request_info_mutex_key'
      ...

        Smart Checklist

          Attachments

            Activity

              People

              Assignee:
              vladislav.lesin Vladislav Lesin (Inactive)
              Reporter:
              george.lorch George Lorch
              Votes:
              0 Vote for this issue
              Watchers:
              2 Start watching this issue

                Dates

                Created:
                Updated:
                Resolved: